{"text_format":"3","workbook":"xlsx","n_sheets":4,"sheets":["Programación Por Profesional","Programacion Total Establecimie","Rendimientos","Hrs a ambulatorio"],"read":"whole","date_system":"1900"}

{"sheet":"Programación Por Profesional","index":0,"n_rows":33,"n_cols":47,"rows_kept":33,"merged":[[1,5,1,34],[2,0,2,2],[2,5,3,5],[2,6,3,6],[2,7,2,10],[2,11,2,14],[2,15,2,18],[2,19,2,22],[2,23,2,26],[2,27,2,30],[2,31,2,32],[2,33,2,36],[3,0,3,1],[17,3,17,7],[17,8,17,13],[17,15,17,43],[18,0,18,2],[18,6,18,7],[18,8,18,9],[18,10,18,11],[18,12,18,13],[18,15,19,16],[18,17,19,17],[18,18,18,19],[18,20,18,21],[18,22,18,23],[18,24,18,25],[18,26,18,27],[18,28,18,29],[18,30,18,31],[18,32,18,33],[18,34,18,35],[18,36,18,37],[18,38,18,39],[18,40,18,41],[18,42,18,43],[19,0,19,1],[30,0,30,2],[30,15,30,17]]}
[]
[{"$nulls":5},"PROGRAMACIÓN SEMANAL"]
["Distribución Semanal de Actividades Clinicas y Administrativas por Profesional",{"$nulls":4},"Hrs Semanales contratadas","Hrs          Semanales Programadas","CONSULTA AMBULATORIA",{"$nulls":3},"PROCEDIMIENTOS",{"$nulls":3},"CIRUGIAS",{"$nulls":3},"VISITA A SALA ",{"$nulls":3},"IC",{"$nulls":3},"CONSULTAS ABREVIADAS",{"$nulls":3},"Actividades  Administrativas y Reuniones",null,"OTRO"]
["Nombre del Profesional",null,"Especialidad o Programa ","Tipo de contrato (Contrata / Honorario)","LEY (18834 o 19664) ",null,null,"% hrs.","Hrs /semana","Rendimiento","Nº Pacientes Semanales      ","% hrs.","Hrs /semana","Rendimiento","Nº Pacientes Semanales      ","% hrs.","Hrs /semana","Rendimiento","Nº Pacientes Semanales      ","% hrs.","Hrs /semana","Rendimiento","Nº Pacientes Semanales      ","% hrs.","Hrs /semana","Rendimiento","Nº Pacientes Semanales      ","% hrs.","Hrs /semana","Rendimiento","Nº Pacientes Semanales      ","% hrs.","Hrs /semana","% hrs.","Hrs /semana","Rendimiento","Nº Pacientes Semanales"]
[{"$nulls":7},{"$f":"+I5/F5","v":{"$error":"#DIV/0!"}},{"v":10,"d":"10.0"},{"v":4,"d":"4.0"},{"$f":"+I5*J5","v":40},{"$f":"M5/F5","v":{"$error":"#DIV/0!"}},{"v":10,"d":"10.0"},{"$f":"VLOOKUP(M5,Rendimientos!E:F,2,FALSE)","v":{"$error":"#N/A"}},{"$f":"M5*N5","v":{"$error":"#N/A"}},{"$f":"+Q5/F5","v":{"$error":"#DIV/0!"}},null,{"$f":"VLOOKUP(Q5,Rendimientos!I:J,2,FALSE)","v":{"$error":"#N/A"}},{"$f":"+Q5*R5","v":{"$error":"#N/A"}},{"$f":"+U5/F5","v":{"$error":"#DIV/0!"}},null,{"$f":"VLOOKUP(U5,Rendimientos!M:N,2,FALSE)","v":{"$error":"#N/A"}},{"$f":"+U5*V5","v":{"$error":"#N/A"}},{"$f":"+Y5/F5","v":{"$error":"#DIV/0!"}},null,{"$f":"VLOOKUP(Y5,Rendimientos!Q:R,2,FALSE)","v":{"$error":"#N/A"}},{"$f":"+Y5*Z5","v":{"$error":"#N/A"}},{"$f":"+AC5/F5","v":{"$error":"#DIV/0!"}},null,{"$f":"VLOOKUP(AC5,Rendimientos!U:V,2,FALSE)","v":{"$error":"#N/A"}},{"$f":"+AC5*AD5","v":{"$error":"#N/A"}},{"$f":"+AG5/F5","v":{"$error":"#DIV/0!"}},null,{"$f":"+AI5/F5","v":{"$error":"#DIV/0!"}},null,{"$f":"VLOOKUP(AI5,Rendimientos!AA:AB,2,FALSE)","v":{"$error":"#N/A"}},{"$f":"+AI5*AJ5","v":{"$error":"#N/A"}}]
[{"$nulls":7},{"$f":"+I6/F6","v":{"$error":"#DIV/0!"}},null,{"$f":"VLOOKUP(C6,Rendimientos!A:B,2,FALSE)","v":{"$error":"#N/A"}},{"$f":"+I6*J6","v":{"$error":"#N/A"}},{"$f":"M6/F6","v":{"$error":"#DIV/0!"}},null,{"$f":"VLOOKUP(M6,Rendimientos!E:F,2,FALSE)","v":{"$error":"#N/A"}},{"$f":"M6*N6","v":{"$error":"#N/A"}},{"$f":"+Q6/F6","v":{"$error":"#DIV/0!"}},null,{"$f":"VLOOKUP(Q6,Rendimientos!I:J,2,FALSE)","v":{"$error":"#N/A"}},{"$f":"+Q6*R6","v":{"$error":"#N/A"}},{"$f":"+U6/F6","v":{"$error":"#DIV/0!"}},null,{"$f":"VLOOKUP(U6,Rendimientos!M:N,2,FALSE)","v":{"$error":"#N/A"}},{"$f":"+U6*V6","v":{"$error":"#N/A"}},{"$f":"+Y6/F6","v":{"$error":"#DIV/0!"}},null,{"$f":"VLOOKUP(Y6,Rendimientos!Q:R,2,FALSE)","v":{"$error":"#N/A"}},{"$f":"+Y6*Z6","v":{"$error":"#N/A"}},{"$f":"+AC6/F6","v":{"$error":"#DIV/0!"}},null,{"$f":"VLOOKUP(AC6,Rendimientos!U:V,2,FALSE)","v":{"$error":"#N/A"}},{"$f":"+AC6*AD6","v":{"$error":"#N/A"}},{"$f":"+AG6/F6","v":{"$error":"#DIV/0!"}},null,{"$f":"+AI6/F6","v":{"$error":"#DIV/0!"}},null,{"$f":"VLOOKUP(AI6,Rendimientos!AA:AB,2,FALSE)","v":{"$error":"#N/A"}},{"$f":"+AI6*AJ6","v":{"$error":"#N/A"}}]
[{"$nulls":7},{"$error":"#DIV/0!"},null,{"$f":"VLOOKUP(C7,Rendimientos!A:B,2,FALSE)","v":{"$error":"#N/A"}},{"$error":"#N/A"},{"$error":"#DIV/0!"},null,{"$f":"VLOOKUP(M7,Rendimientos!E:F,2,FALSE)","v":{"$error":"#N/A"}},{"$error":"#N/A"},{"$error":"#DIV/0!"},null,{"$f":"VLOOKUP(Q7,Rendimientos!I:J,2,FALSE)","v":{"$error":"#N/A"}},{"$error":"#N/A"},{"$error":"#DIV/0!"},null,{"$f":"VLOOKUP(U7,Rendimientos!M:N,2,FALSE)","v":{"$error":"#N/A"}},{"$error":"#N/A"},{"$error":"#DIV/0!"},null,{"$f":"VLOOKUP(Y7,Rendimientos!Q:R,2,FALSE)","v":{"$error":"#N/A"}},{"$error":"#N/A"},{"$error":"#DIV/0!"},null,{"$f":"VLOOKUP(AC7,Rendimientos!U:V,2,FALSE)","v":{"$error":"#N/A"}},{"$error":"#N/A"},{"$error":"#DIV/0!"},null,{"$error":"#DIV/0!"},null,{"$f":"VLOOKUP(AI7,Rendimientos!AA:AB,2,FALSE)","v":{"$error":"#N/A"}},{"$error":"#N/A"}]
[{"$nulls":7},{"$error":"#DIV/0!"},null,{"$f":"VLOOKUP(C8,Rendimientos!A:B,2,FALSE)","v":{"$error":"#N/A"}},{"$error":"#N/A"},{"$error":"#DIV/0!"},null,{"$f":"VLOOKUP(M8,Rendimientos!E:F,2,FALSE)","v":{"$error":"#N/A"}},{"$error":"#N/A"},{"$error":"#DIV/0!"},null,{"$f":"VLOOKUP(Q8,Rendimientos!I:J,2,FALSE)","v":{"$error":"#N/A"}},{"$error":"#N/A"},{"$error":"#DIV/0!"},null,{"$f":"VLOOKUP(U8,Rendimientos!M:N,2,FALSE)","v":{"$error":"#N/A"}},{"$error":"#N/A"},{"$error":"#DIV/0!"},null,{"$f":"VLOOKUP(Y8,Rendimientos!Q:R,2,FALSE)","v":{"$error":"#N/A"}},{"$error":"#N/A"},{"$error":"#DIV/0!"},null,{"$f":"VLOOKUP(AC8,Rendimientos!U:V,2,FALSE)","v":{"$error":"#N/A"}},{"$error":"#N/A"},{"$error":"#DIV/0!"},null,{"$error":"#DIV/0!"},null,{"$f":"VLOOKUP(AI8,Rendimientos!AA:AB,2,FALSE)","v":{"$error":"#N/A"}},{"$error":"#N/A"}]
[{"$nulls":7},{"$error":"#DIV/0!"},null,{"$f":"VLOOKUP(C9,Rendimientos!A:B,2,FALSE)","v":{"$error":"#N/A"}},{"$error":"#N/A"},{"$error":"#DIV/0!"},null,{"$f":"VLOOKUP(M9,Rendimientos!E:F,2,FALSE)","v":{"$error":"#N/A"}},{"$error":"#N/A"},{"$error":"#DIV/0!"},null,{"$f":"VLOOKUP(Q9,Rendimientos!I:J,2,FALSE)","v":{"$error":"#N/A"}},{"$error":"#N/A"},{"$error":"#DIV/0!"},null,{"$f":"VLOOKUP(U9,Rendimientos!M:N,2,FALSE)","v":{"$error":"#N/A"}},{"$error":"#N/A"},{"$error":"#DIV/0!"},null,{"$f":"VLOOKUP(Y9,Rendimientos!Q:R,2,FALSE)","v":{"$error":"#N/A"}},{"$error":"#N/A"},{"$error":"#DIV/0!"},null,{"$f":"VLOOKUP(AC9,Rendimientos!U:V,2,FALSE)","v":{"$error":"#N/A"}},{"$error":"#N/A"},{"$error":"#DIV/0!"},null,{"$error":"#DIV/0!"},null,{"$f":"VLOOKUP(AI9,Rendimientos!AA:AB,2,FALSE)","v":{"$error":"#N/A"}},{"$error":"#N/A"}]
[{"$nulls":7},{"$error":"#DIV/0!"},null,{"$f":"VLOOKUP(C10,Rendimientos!A:B,2,FALSE)","v":{"$error":"#N/A"}},{"$error":"#N/A"},{"$error":"#DIV/0!"},null,{"$f":"VLOOKUP(M10,Rendimientos!E:F,2,FALSE)","v":{"$error":"#N/A"}},{"$error":"#N/A"},{"$error":"#DIV/0!"},null,{"$f":"VLOOKUP(Q10,Rendimientos!I:J,2,FALSE)","v":{"$error":"#N/A"}},{"$error":"#N/A"},{"$error":"#DIV/0!"},null,{"$f":"VLOOKUP(U10,Rendimientos!M:N,2,FALSE)","v":{"$error":"#N/A"}},{"$error":"#N/A"},{"$error":"#DIV/0!"},null,{"$f":"VLOOKUP(Y10,Rendimientos!Q:R,2,FALSE)","v":{"$error":"#N/A"}},{"$error":"#N/A"},{"$error":"#DIV/0!"},null,{"$f":"VLOOKUP(AC10,Rendimientos!U:V,2,FALSE)","v":{"$error":"#N/A"}},{"$error":"#N/A"},{"$error":"#DIV/0!"},null,{"$error":"#DIV/0!"},null,{"$f":"VLOOKUP(AI10,Rendimientos!AA:AB,2,FALSE)","v":{"$error":"#N/A"}},{"$error":"#N/A"}]
[{"$nulls":7},{"$error":"#DIV/0!"},null,{"$f":"VLOOKUP(C11,Rendimientos!A:B,2,FALSE)","v":{"$error":"#N/A"}},{"$error":"#N/A"},{"$error":"#DIV/0!"},null,{"$f":"VLOOKUP(M11,Rendimientos!E:F,2,FALSE)","v":{"$error":"#N/A"}},{"$error":"#N/A"},{"$error":"#DIV/0!"},null,{"$f":"VLOOKUP(Q11,Rendimientos!I:J,2,FALSE)","v":{"$error":"#N/A"}},{"$error":"#N/A"},{"$error":"#DIV/0!"},null,{"$f":"VLOOKUP(U11,Rendimientos!M:N,2,FALSE)","v":{"$error":"#N/A"}},{"$error":"#N/A"},{"$error":"#DIV/0!"},null,{"$f":"VLOOKUP(Y11,Rendimientos!Q:R,2,FALSE)","v":{"$error":"#N/A"}},{"$error":"#N/A"},{"$error":"#DIV/0!"},null,{"$f":"VLOOKUP(AC11,Rendimientos!U:V,2,FALSE)","v":{"$error":"#N/A"}},{"$error":"#N/A"},{"$error":"#DIV/0!"},null,{"$error":"#DIV/0!"},null,{"$f":"VLOOKUP(AI11,Rendimientos!AA:AB,2,FALSE)","v":{"$error":"#N/A"}},{"$error":"#N/A"}]
[{"$nulls":7},{"$error":"#DIV/0!"},null,{"$f":"VLOOKUP(C12,Rendimientos!A:B,2,FALSE)","v":{"$error":"#N/A"}},{"$error":"#N/A"},{"$error":"#DIV/0!"},null,{"$f":"VLOOKUP(M12,Rendimientos!E:F,2,FALSE)","v":{"$error":"#N/A"}},{"$error":"#N/A"},{"$error":"#DIV/0!"},null,{"$f":"VLOOKUP(Q12,Rendimientos!I:J,2,FALSE)","v":{"$error":"#N/A"}},{"$error":"#N/A"},{"$error":"#DIV/0!"},null,{"$f":"VLOOKUP(U12,Rendimientos!M:N,2,FALSE)","v":{"$error":"#N/A"}},{"$error":"#N/A"},{"$error":"#DIV/0!"},null,{"$f":"VLOOKUP(Y12,Rendimientos!Q:R,2,FALSE)","v":{"$error":"#N/A"}},{"$error":"#N/A"},{"$error":"#DIV/0!"},null,{"$f":"VLOOKUP(AC12,Rendimientos!U:V,2,FALSE)","v":{"$error":"#N/A"}},{"$error":"#N/A"},{"$error":"#DIV/0!"},null,{"$error":"#DIV/0!"},null,{"$f":"VLOOKUP(AI12,Rendimientos!AA:AB,2,FALSE)","v":{"$error":"#N/A"}},{"$error":"#N/A"}]
[{"$nulls":7},{"$error":"#DIV/0!"},null,{"$f":"VLOOKUP(C13,Rendimientos!A:B,2,FALSE)","v":{"$error":"#N/A"}},{"$error":"#N/A"},{"$error":"#DIV/0!"},null,{"$f":"VLOOKUP(M13,Rendimientos!E:F,2,FALSE)","v":{"$error":"#N/A"}},{"$error":"#N/A"},{"$error":"#DIV/0!"},null,{"$f":"VLOOKUP(Q13,Rendimientos!I:J,2,FALSE)","v":{"$error":"#N/A"}},{"$error":"#N/A"},{"$error":"#DIV/0!"},null,{"$f":"VLOOKUP(U13,Rendimientos!M:N,2,FALSE)","v":{"$error":"#N/A"}},{"$error":"#N/A"},{"$error":"#DIV/0!"},null,{"$f":"VLOOKUP(Y13,Rendimientos!Q:R,2,FALSE)","v":{"$error":"#N/A"}},{"$error":"#N/A"},{"$error":"#DIV/0!"},null,{"$f":"VLOOKUP(AC13,Rendimientos!U:V,2,FALSE)","v":{"$error":"#N/A"}},{"$error":"#N/A"},{"$error":"#DIV/0!"},null,{"$error":"#DIV/0!"},null,{"$f":"VLOOKUP(AI13,Rendimientos!AA:AB,2,FALSE)","v":{"$error":"#N/A"}},{"$error":"#N/A"}]
[{"$nulls":7},{"$error":"#DIV/0!"},null,{"$f":"VLOOKUP(C14,Rendimientos!A:B,2,FALSE)","v":{"$error":"#N/A"}},{"$error":"#N/A"},{"$error":"#DIV/0!"},null,{"$f":"VLOOKUP(M14,Rendimientos!E:F,2,FALSE)","v":{"$error":"#N/A"}},{"$error":"#N/A"},{"$error":"#DIV/0!"},null,{"$f":"VLOOKUP(Q14,Rendimientos!I:J,2,FALSE)","v":{"$error":"#N/A"}},{"$error":"#N/A"},{"$error":"#DIV/0!"},null,{"$f":"VLOOKUP(U14,Rendimientos!M:N,2,FALSE)","v":{"$error":"#N/A"}},{"$error":"#N/A"},{"$error":"#DIV/0!"},null,{"$f":"VLOOKUP(Y14,Rendimientos!Q:R,2,FALSE)","v":{"$error":"#N/A"}},{"$error":"#N/A"},{"$error":"#DIV/0!"},null,{"$f":"VLOOKUP(AC14,Rendimientos!U:V,2,FALSE)","v":{"$error":"#N/A"}},{"$error":"#N/A"},{"$error":"#DIV/0!"},null,{"$error":"#DIV/0!"},null,{"$f":"VLOOKUP(AI14,Rendimientos!AA:AB,2,FALSE)","v":{"$error":"#N/A"}},{"$error":"#N/A"}]
[{"$nulls":7},{"$error":"#DIV/0!"},null,{"$f":"VLOOKUP(C15,Rendimientos!A:B,2,FALSE)","v":{"$error":"#N/A"}},{"$error":"#N/A"},{"$error":"#DIV/0!"},null,{"$f":"VLOOKUP(M15,Rendimientos!E:F,2,FALSE)","v":{"$error":"#N/A"}},{"$error":"#N/A"},{"$f":"+Q15/F15","v":{"$error":"#DIV/0!"}},null,{"$f":"VLOOKUP(Q15,Rendimientos!I:J,2,FALSE)","v":{"$error":"#N/A"}},{"$error":"#N/A"},{"$error":"#DIV/0!"},null,{"$f":"VLOOKUP(U15,Rendimientos!M:N,2,FALSE)","v":{"$error":"#N/A"}},{"$error":"#N/A"},{"$error":"#DIV/0!"},null,{"$f":"VLOOKUP(Y15,Rendimientos!Q:R,2,FALSE)","v":{"$error":"#N/A"}},{"$error":"#N/A"},{"$error":"#DIV/0!"},null,{"$f":"VLOOKUP(AC15,Rendimientos!U:V,2,FALSE)","v":{"$error":"#N/A"}},{"$error":"#N/A"},{"$error":"#DIV/0!"},null,{"$error":"#DIV/0!"},null,{"$f":"VLOOKUP(AI15,Rendimientos!AA:AB,2,FALSE)","v":{"$error":"#N/A"}},{"$error":"#N/A"}]
[]
[]
[{"$nulls":3},"Descuento de Feriados Legales, Permisos Administrativos y Capcacitación",{"$nulls":4},"PRODUCCIÓN ANUAL",{"$nulls":6},"CONSULTAS REALIZDAS/ MES "]
["Programación Anual de actividades por Profesional ",null,null,"Vacaciones","Dias de permisos Administrativo","Dias de Congreso o capacitación","Total días no trabajados",null,"Nº consultas            ",null,"Procedimientos  ",null,"Visitas a sala          ",null,null,"Nombre del Profesional ",null,"Especialidad o Programa","Enero",null,"Febrero",null,"Marzo",null,"Abril",null,"Mayo",null,"Junio",null,"Julio",null,"Agosto",null,"Septiembre",null,"Octubre",null,"Noviembre",null,"Diciembre",null,"Total año 2015"]
["Nombre del Profesional",null,"Especialidad o Programa","Dias Anuales","Dias Anuales","Dias Anuales","En Dias Anuales","En Semanas Anuales","Nº Pacientes Anuales        (En 50 sem)","Nº Pacientes Anuales  descontando dias FL, Cap y PA","Nº Procedimientos Anuales          (En 50 sem)","Nº Procedimientos Anuales descontando dias FL, Cap y PA","Nº Visitas Anuales            (? x Hr)","Nº Visitas Anuales descontando dias FL, Cap y PA",{"$nulls":4},"Nº atendido","Nº NSP","Nº atendido","Nº NSP","Nº atendido","Nº NSP","Nº atendido","Nº NSP","Nº atendido","Nº NSP","Nº atendido","Nº NSP","Nº atendido","Nº NSP","Nº atendido","Nº NSP","Nº atendido","Nº NSP","Nº atendido","Nº NSP","Nº atendido","Nº NSP","Nº atendido","Nº NSP","Nº atendido","Nº NSP",null,"% de Cumplimiento a Mayo"]
{"$rows_left_out":14}
{"sheet":"Programacion Total Establecimie","index":1,"n_rows":62,"n_cols":5,"rows_kept":62,"merged":[[0,0,1,0],[0,1,1,1],[0,2,0,3],[0,4,1,4]]}
["Especialidades ","Programado Anual de Consultas 2015","Total Producción de Consultas",null,"% Cumplimiento"]
[null,null,"Relizado","NSP"]
["Broncopulmonar",{"$f":"SUMIF('Programación Por Profesional'!$C$21:$J$30,'Programacion Total Establecimie'!A3,'Programación Por Profesional'!$J$21:$J$30)","v":0},{"$f":"SUMIF('Programación Por Profesional'!$R$21:$AR$30,'Programacion Total Establecimie'!A3,'Programación Por Profesional'!$AQ$21:$AQ$30)","v":0},{"$f":"SUMIF('Programación Por Profesional'!$R$21:$AR$30,'Programacion Total Establecimie'!A3,'Programación Por Profesional'!$AR$21:$AR$30)","v":0},{"$f":"C3/B3","v":{"$error":"#DIV/0!"}}]
["Cardiología",{"$f":"SUMIF('Programación Por Profesional'!$C$21:$J$30,'Programacion Total Establecimie'!A4,'Programación Por Profesional'!$J$21:$J$30)","v":0},{"$f":"SUMIF('Programación Por Profesional'!$R$21:$AR$30,'Programacion Total Establecimie'!A4,'Programación Por Profesional'!$AQ$21:$AQ$30)","v":0},{"$f":"SUMIF('Programación Por Profesional'!$R$21:$AR$30,'Programacion Total Establecimie'!A4,'Programación Por Profesional'!$AR$21:$AR$30)","v":0},{"$f":"C4/B4","v":{"$error":"#DIV/0!"}}]
["Cuidados Paliativos",{"$f":"SUMIF('Programación Por Profesional'!$C$21:$J$30,'Programacion Total Establecimie'!A5,'Programación Por Profesional'!$J$21:$J$30)","v":0},{"$f":"SUMIF('Programación Por Profesional'!$R$21:$AR$30,'Programacion Total Establecimie'!A5,'Programación Por Profesional'!$AQ$21:$AQ$30)","v":0},{"$f":"SUMIF('Programación Por Profesional'!$R$21:$AR$30,'Programacion Total Establecimie'!A5,'Programación Por Profesional'!$AR$21:$AR$30)","v":0},{"$error":"#DIV/0!"}]
["Dermatología",{"$f":"SUMIF('Programación Por Profesional'!$C$21:$J$30,'Programacion Total Establecimie'!A6,'Programación Por Profesional'!$J$21:$J$30)","v":0},{"$f":"SUMIF('Programación Por Profesional'!$R$21:$AR$30,'Programacion Total Establecimie'!A6,'Programación Por Profesional'!$AQ$21:$AQ$30)","v":0},{"$f":"SUMIF('Programación Por Profesional'!$R$21:$AR$30,'Programacion Total Establecimie'!A6,'Programación Por Profesional'!$AR$21:$AR$30)","v":0},{"$error":"#DIV/0!"}]
["Diabetes",{"$f":"SUMIF('Programación Por Profesional'!$C$21:$J$30,'Programacion Total Establecimie'!A7,'Programación Por Profesional'!$J$21:$J$30)","v":0},{"$f":"SUMIF('Programación Por Profesional'!$R$21:$AR$30,'Programacion Total Establecimie'!A7,'Programación Por Profesional'!$AQ$21:$AQ$30)","v":0},{"$f":"SUMIF('Programación Por Profesional'!$R$21:$AR$30,'Programacion Total Establecimie'!A7,'Programación Por Profesional'!$AR$21:$AR$30)","v":0},{"$error":"#DIV/0!"}]
["Endocrinología",{"$f":"SUMIF('Programación Por Profesional'!$C$21:$J$30,'Programacion Total Establecimie'!A8,'Programación Por Profesional'!$J$21:$J$30)","v":0},{"$f":"SUMIF('Programación Por Profesional'!$R$21:$AR$30,'Programacion Total Establecimie'!A8,'Programación Por Profesional'!$AQ$21:$AQ$30)","v":0},{"$f":"SUMIF('Programación Por Profesional'!$R$21:$AR$30,'Programacion Total Establecimie'!A8,'Programación Por Profesional'!$AR$21:$AR$30)","v":0},{"$error":"#DIV/0!"}]
["Gastroenterología",{"$f":"SUMIF('Programación Por Profesional'!$C$21:$J$30,'Programacion Total Establecimie'!A9,'Programación Por Profesional'!$J$21:$J$30)","v":0},{"$f":"SUMIF('Programación Por Profesional'!$R$21:$AR$30,'Programacion Total Establecimie'!A9,'Programación Por Profesional'!$AQ$21:$AQ$30)","v":0},{"$f":"SUMIF('Programación Por Profesional'!$R$21:$AR$30,'Programacion Total Establecimie'!A9,'Programación Por Profesional'!$AR$21:$AR$30)","v":0},{"$error":"#DIV/0!"}]
["Geriatría",{"$f":"SUMIF('Programación Por Profesional'!$C$21:$J$30,'Programacion Total Establecimie'!A10,'Programación Por Profesional'!$J$21:$J$30)","v":0},{"$f":"SUMIF('Programación Por Profesional'!$R$21:$AR$30,'Programacion Total Establecimie'!A10,'Programación Por Profesional'!$AQ$21:$AQ$30)","v":0},{"$f":"SUMIF('Programación Por Profesional'!$R$21:$AR$30,'Programacion Total Establecimie'!A10,'Programación Por Profesional'!$AR$21:$AR$30)","v":0},{"$error":"#DIV/0!"}]
["Infectología",{"$f":"SUMIF('Programación Por Profesional'!$C$21:$J$30,'Programacion Total Establecimie'!A11,'Programación Por Profesional'!$J$21:$J$30)","v":0},{"$f":"SUMIF('Programación Por Profesional'!$R$21:$AR$30,'Programacion Total Establecimie'!A11,'Programación Por Profesional'!$AQ$21:$AQ$30)","v":0},{"$f":"SUMIF('Programación Por Profesional'!$R$21:$AR$30,'Programacion Total Establecimie'!A11,'Programación Por Profesional'!$AR$21:$AR$30)","v":0},{"$error":"#DIV/0!"}]
["Fisiatría",{"$f":"SUMIF('Programación Por Profesional'!$C$21:$J$30,'Programacion Total Establecimie'!A12,'Programación Por Profesional'!$J$21:$J$30)","v":0},{"$f":"SUMIF('Programación Por Profesional'!$R$21:$AR$30,'Programacion Total Establecimie'!A12,'Programación Por Profesional'!$AQ$21:$AQ$30)","v":0},{"$f":"SUMIF('Programación Por Profesional'!$R$21:$AR$30,'Programacion Total Establecimie'!A12,'Programación Por Profesional'!$AR$21:$AR$30)","v":0},{"$error":"#DIV/0!"}]
["Medicina Interna",{"$f":"SUMIF('Programación Por Profesional'!$C$21:$J$30,'Programacion Total Establecimie'!A13,'Programación Por Profesional'!$J$21:$J$30)","v":0},{"$f":"SUMIF('Programación Por Profesional'!$R$21:$AR$30,'Programacion Total Establecimie'!A13,'Programación Por Profesional'!$AQ$21:$AQ$30)","v":0},{"$f":"SUMIF('Programación Por Profesional'!$R$21:$AR$30,'Programacion Total Establecimie'!A13,'Programación Por Profesional'!$AR$21:$AR$30)","v":0},{"$error":"#DIV/0!"}]
["Nefrología",{"$f":"SUMIF('Programación Por Profesional'!$C$21:$J$30,'Programacion Total Establecimie'!A14,'Programación Por Profesional'!$J$21:$J$30)","v":0},{"$f":"SUMIF('Programación Por Profesional'!$R$21:$AR$30,'Programacion Total Establecimie'!A14,'Programación Por Profesional'!$AQ$21:$AQ$30)","v":0},{"$f":"SUMIF('Programación Por Profesional'!$R$21:$AR$30,'Programacion Total Establecimie'!A14,'Programación Por Profesional'!$AR$21:$AR$30)","v":0},{"$error":"#DIV/0!"}]
["Neurología",{"$f":"SUMIF('Programación Por Profesional'!$C$21:$J$30,'Programacion Total Establecimie'!A15,'Programación Por Profesional'!$J$21:$J$30)","v":0},{"$f":"SUMIF('Programación Por Profesional'!$R$21:$AR$30,'Programacion Total Establecimie'!A15,'Programación Por Profesional'!$AQ$21:$AQ$30)","v":0},{"$f":"SUMIF('Programación Por Profesional'!$R$21:$AR$30,'Programacion Total Establecimie'!A15,'Programación Por Profesional'!$AR$21:$AR$30)","v":0},{"$error":"#DIV/0!"}]
["Nutrición",{"$f":"SUMIF('Programación Por Profesional'!$C$21:$J$30,'Programacion Total Establecimie'!A16,'Programación Por Profesional'!$J$21:$J$30)","v":0},{"$f":"SUMIF('Programación Por Profesional'!$R$21:$AR$30,'Programacion Total Establecimie'!A16,'Programación Por Profesional'!$AQ$21:$AQ$30)","v":0},{"$f":"SUMIF('Programación Por Profesional'!$R$21:$AR$30,'Programacion Total Establecimie'!A16,'Programación Por Profesional'!$AR$21:$AR$30)","v":0},{"$error":"#DIV/0!"}]
["Oncohematología",{"$f":"SUMIF('Programación Por Profesional'!$C$21:$J$30,'Programacion Total Establecimie'!A17,'Programación Por Profesional'!$J$21:$J$30)","v":0},{"$f":"SUMIF('Programación Por Profesional'!$R$21:$AR$30,'Programacion Total Establecimie'!A17,'Programación Por Profesional'!$AQ$21:$AQ$30)","v":0},{"$f":"SUMIF('Programación Por Profesional'!$R$21:$AR$30,'Programacion Total Establecimie'!A17,'Programación Por Profesional'!$AR$21:$AR$30)","v":0},{"$error":"#DIV/0!"}]
["Psiquiatría",{"$f":"SUMIF('Programación Por Profesional'!$C$21:$J$30,'Programacion Total Establecimie'!A18,'Programación Por Profesional'!$J$21:$J$30)","v":0},{"$f":"SUMIF('Programación Por Profesional'!$R$21:$AR$30,'Programacion Total Establecimie'!A18,'Programación Por Profesional'!$AQ$21:$AQ$30)","v":0},{"$f":"SUMIF('Programación Por Profesional'!$R$21:$AR$30,'Programacion Total Establecimie'!A18,'Programación Por Profesional'!$AR$21:$AR$30)","v":0},{"$error":"#DIV/0!"}]
["Reumatología",{"$f":"SUMIF('Programación Por Profesional'!$C$21:$J$30,'Programacion Total Establecimie'!A19,'Programación Por Profesional'!$J$21:$J$30)","v":0},{"$f":"SUMIF('Programación Por Profesional'!$R$21:$AR$30,'Programacion Total Establecimie'!A19,'Programación Por Profesional'!$AQ$21:$AQ$30)","v":0},{"$f":"SUMIF('Programación Por Profesional'!$R$21:$AR$30,'Programacion Total Establecimie'!A19,'Programación Por Profesional'!$AR$21:$AR$30)","v":0},{"$error":"#DIV/0!"}]
["Cardiocirugía",{"$f":"SUMIF('Programación Por Profesional'!$C$21:$J$30,'Programacion Total Establecimie'!A20,'Programación Por Profesional'!$J$21:$J$30)","v":0},{"$f":"SUMIF('Programación Por Profesional'!$R$21:$AR$30,'Programacion Total Establecimie'!A20,'Programación Por Profesional'!$AQ$21:$AQ$30)","v":0},{"$f":"SUMIF('Programación Por Profesional'!$R$21:$AR$30,'Programacion Total Establecimie'!A20,'Programación Por Profesional'!$AR$21:$AR$30)","v":0},{"$error":"#DIV/0!"}]
{"$rows_left_out":43}
{"sheet":"Rendimientos","index":2,"n_rows":62,"n_cols":2,"rows_kept":62}
["Especialidad  ","Rendimiento por Hora Sugerido"]
["ADULTO "]
["Broncopulmonar",4]
["Cardiología",4]
["Cuidados Paliativos",3]
["Dermatología",5]
["Diabetes",4]
["Endocrinología",4]
["Gastroenterología",4]
["Geriatría",3]
["Infectología",3]
["Fisiatría",3]
["Medicina Interna",4]
["Nefrología",4]
["Neurología",3]
["Nutrición",4]
["Oncohematología",3]
["Psiquiatría",2]
["Reumatología",4]
["Cardiocirugía",3]
{"$rows_left_out":43}
{"sheet":"Hrs a ambulatorio","index":3,"n_rows":66,"n_cols":5,"rows_kept":66}
[]
["Especialidad médica  Adulto","min ","Promedio","max","Sugerencia estándar"]
["Broncopulmonar",7,{"v":39.995950413223134,"d":"40"},80,40]
["Cardiología",{"v":11.36,"d":"11"},{"v":48.71027831143216,"d":"49"},95,50]
["Cuidados Paliativos",1,{"v":46.35465058750773,"d":"46"},100,80]
["Dermatología",1,{"v":55.133738404452686,"d":"55"},{"v":160.59,"d":"161"},90]
["Diabetes",1,{"v":52.73051948051948,"d":"53"},{"v":97.7272727272727,"d":"98"},60]
["Endocrinología",{"v":20.2020202020202,"d":"20"},{"v":50.128876262626264,"d":"50"},100,60]
["Gastroenterología",4,{"v":41.881529581529584,"d":"42"},80,50]
["Geriatría",10,{"v":41.04,"d":"41"},104,50]
["Infectología",{"v":11.3,"d":"11"},{"v":33.69477272727273,"d":"34"},{"v":83.5,"d":"84"},40]
["Fisiatría",11,{"v":43.301477272727276,"d":"43"},{"v":98.2,"d":"98"},50]
["Medicina Interna",1,{"v":41.75340587340587,"d":"42"},{"v":213.63,"d":"214"},50]
["Nefrología",11,{"v":45.43727272727272,"d":"45"},111,50]
["Neurología",17,{"v":47.88200879765397,"d":"48"},111,50]
["Nutrición",{"v":9.09,"d":"9"},{"v":50.077999999999996,"d":"50"},{"v":107.3,"d":"107"},50]
["Oncohematología",24,{"v":52.315,"d":"52"},{"v":126.69,"d":"127"},50]
["Psiquiatría",1,{"v":59.71186204146729,"d":"60"},109,60]
["Reumatología",11,{"v":51.472545454545454,"d":"51"},91,60]
[]
{"$rows_left_out":46}